IntegrationTest fails in assessment

This is log file of unit tests.

Due to word limit i have deleted the previous log.

TEST RESULT: SUCCESS
TEST SUMMARY: RAN 3 TESTS, 3 SUCCEEDED, 0 FAILED, 0 SKIPPED

Deprecated Gradle features were used in this build, making it incompatible with Gradle 6.0.
Use ‘–warning-mode all’ to show the individual deprecation warnings.
See https://docs.gradle.org/5.2.1/userguide/command_line_interface.html#sec:command_line_warnings

BUILD SUCCESSFUL in 24s
7 actionable tasks: 2 executed, 5 up-to-date

2020-07-18 18:52:57,253 unitTesting-ff87a5ce-34b0-4354-ae0d-7fc70311e45d INFO Gradle test run complete
2020-07-18 18:52:57,256 unitTesting-ff87a5ce-34b0-4354-ae0d-7fc70311e45d INFO User test results generated
2020-07-18 18:52:57,256 unitTesting-ff87a5ce-34b0-4354-ae0d-7fc70311e45d INFO Cloning assessment repo
2020-07-18 18:52:59,766 unitTesting-ff87a5ce-34b0-4354-ae0d-7fc70311e45d INFO Starting server…
2020-07-18 18:54:37,412 unitTesting-ff87a5ce-34b0-4354-ae0d-7fc70311e45d INFO
Integration test log:
start running tests
Starting a Gradle Daemon, 1 busy Daemon could not be reused, use --status for details

Task :clean UP-TO-DATE
Task :compileJava
Task :processResources
Task :classes
Task :compileTestJava
Task :processTestResources
Task :testClasses

Task :test

com.crio.buildouts.integ.test.IntegrationTest > executeTests() STANDARD_ERROR
Jul 18, 2020 6:54:34 PM com.crio.buildouts.integ.test.IntegrationTest executeGetRequest
WARNING: {“questions”:[{“moduleId”:null,“questionId”:“1”,“title”:“What is the default IP address of localhost?”,“description”:“General question”,“type”:“objective-single”,“options”:{“1”:“0.0.0.0”,“2”:“192.168.0.12”,“3”:“127.0.0.1”,“4”:“255.255.255.255”}}]}

com.crio.buildouts.integ.test.IntegrationTest > executeTests() FAILED
java.lang.AssertionError: questions[]: Expected 12 values but got 1
at org.skyscreamer.jsonassert.JSONAssert.assertEquals(JSONAssert.java:417)
at org.skyscreamer.jsonassert.JSONAssert.assertEquals(JSONAssert.java:394)
at org.skyscreamer.jsonassert.JSONAssert.assertEquals(JSONAssert.java:336)
at com.crio.buildouts.integ.test.IntegrationTest.executeGetRequest(IntegrationTest.java:160)
at com.crio.buildouts.integ.test.IntegrationTest.executeTest(IntegrationTest.java:56)
at com.crio.buildouts.integ.test.IntegrationTest.lambda$executeTests$1(IntegrationTest.java:75)
at java.util.stream.ReferencePipeline$3$1.accept(ReferencePipeline.java:193)
at java.util.Spliterators$ArraySpliterator.forEachRemaining(Spliterators.java:948)
at java.util.stream.AbstractPipeline.copyInto(AbstractPipeline.java:482)
at java.util.stream.AbstractPipeline.wrapAndCopyInto(AbstractPipeline.java:472)
at java.util.stream.ReduceOps$ReduceOp.evaluateSequential(ReduceOps.java:708)
at java.util.stream.AbstractPipeline.evaluate(AbstractPipeline.java:234)
at java.util.stream.ReferencePipeline.collect(ReferencePipeline.java:566)
at com.crio.buildouts.integ.test.IntegrationTest.executeTests(IntegrationTest.java:82)
at org.junit.platform.commons.util.ReflectionUtils.invokeMethod(ReflectionUtils.java:675)
at org.junit.jupiter.engine.execution.ExecutableInvoker.invoke(ExecutableInvoker.java:115)
at org.junit.jupiter.engine.descriptor.TestMethodTestDescriptor.lambda$invokeTestMethod$6(TestMethodTestDescriptor.java:171)
at org.junit.platform.engine.support.hierarchical.ThrowableCollector.execute(ThrowableCollector.java:73)
at org.junit.jupiter.engine.descriptor.TestMethodTestDescriptor.invokeTestMethod(TestMethodTestDescriptor.java:167)
at org.junit.jupiter.engine.descriptor.TestMethodTestDescriptor.execute(TestMethodTestDescriptor.java:114)
at org.junit.jupiter.engine.descriptor.TestMethodTestDescriptor.execute(TestMethodTestDescriptor.java:59)
at org.junit.platform.engine.support.hierarchical.NodeTestTask.lambda$executeRecursively$5(NodeTestTask.java:135)
at org.junit.platform.engine.support.hierarchical.ThrowableCollector.execute(ThrowableCollector.java:73)
at org.junit.platform.engine.support.hierarchical.NodeTestTask.lambda$executeRecursively$7(NodeTestTask.java:125)
at org.junit.platform.engine.support.hierarchical.Node.around(Node.java:135)
at org.junit.platform.engine.support.hierarchical.NodeTestTask.lambda$executeRecursively$8(NodeTestTask.java:123)
at org.junit.platform.engine.support.hierarchical.ThrowableCollector.execute(ThrowableCollector.java:73)
at org.junit.platform.engine.support.hierarchical.NodeTestTask.executeRecursively(NodeTestTask.java:122)
at org.junit.platform.engine.support.hierarchical.NodeTestTask.execute(NodeTestTask.java:80)
at java.util.ArrayList.forEach(ArrayList.java:1257)
at org.junit.platform.engine.support.hierarchical.SameThreadHierarchicalTestExecutorService.invokeAll(SameThreadHierarchicalTestExecutorService.java:38)
at org.junit.platform.engine.support.hierarchical.NodeTestTask.lambda$executeRecursively$5(NodeTestTask.java:139)
at org.junit.platform.engine.support.hierarchical.ThrowableCollector.execute(ThrowableCollector.java:73)
at org.junit.platform.engine.support.hierarchical.NodeTestTask.lambda$executeRecursively$7(NodeTestTask.java:125)
at org.junit.platform.engine.support.hierarchical.Node.around(Node.java:135)
at org.junit.platform.engine.support.hierarchical.NodeTestTask.lambda$executeRecursively$8(NodeTestTask.java:123)
at org.junit.platform.engine.support.hierarchical.ThrowableCollector.execute(ThrowableCollector.java:73)
at org.junit.platform.engine.support.hierarchical.NodeTestTask.executeRecursively(NodeTestTask.java:122)
at org.junit.platform.engine.support.hierarchical.NodeTestTask.execute(NodeTestTask.java:80)
at java.util.ArrayList.forEach(ArrayList.java:1257)
at org.junit.platform.engine.support.hierarchical.SameThreadHierarchicalTestExecutorService.invokeAll(SameThreadHierarchicalTestExecutorService.java:38)
at org.junit.platform.engine.support.hierarchical.NodeTestTask.lambda$executeRecursively$5(NodeTestTask.java:139)
at org.junit.platform.engine.support.hierarchical.ThrowableCollector.execute(ThrowableCollector.java:73)
at org.junit.platform.engine.support.hierarchical.NodeTestTask.lambda$executeRecursively$7(NodeTestTask.java:125)
at org.junit.platform.engine.support.hierarchical.Node.around(Node.java:135)
at org.junit.platform.engine.support.hierarchical.NodeTestTask.lambda$executeRecursively$8(NodeTestTask.java:123)
at org.junit.platform.engine.support.hierarchical.ThrowableCollector.execute(ThrowableCollector.java:73)
at org.junit.platform.engine.support.hierarchical.NodeTestTask.executeRecursively(NodeTestTask.java:122)
at org.junit.platform.engine.support.hierarchical.NodeTestTask.execute(NodeTestTask.java:80)
at org.junit.platform.engine.support.hierarchical.SameThreadHierarchicalTestExecutorService.submit(SameThreadHierarchicalTestExecutorService.java:32)
at org.junit.platform.engine.support.hierarchical.HierarchicalTestExecutor.execute(HierarchicalTestExecutor.java:57)
at org.junit.platform.engine.support.hierarchical.HierarchicalTestEngine.execute(HierarchicalTestEngine.java:51)
at org.junit.platform.launcher.core.DefaultLauncher.execute(DefaultLauncher.java:220)
at org.junit.platform.launcher.core.DefaultLauncher.lambda$execute$6(DefaultLauncher.java:188)
at org.junit.platform.launcher.core.DefaultLauncher.withInterceptedStreams(DefaultLauncher.java:202)
at org.junit.platform.launcher.core.DefaultLauncher.execute(DefaultLauncher.java:181)
at org.junit.platform.launcher.core.DefaultLauncher.execute(DefaultLauncher.java:128)
at org.gradle.api.internal.tasks.testing.junitplatform.JUnitPlatformTestClassProcessor$CollectAllTestClassesExecutor.processAllTestClasses(JUnitPlatformTestClassProcessor.java:102)
at org.gradle.api.internal.tasks.testing.junitplatform.JUnitPlatformTestClassProcessor$CollectAllTestClassesExecutor.access$000(JUnitPlatformTestClassProcessor.java:82)
at org.gradle.api.internal.tasks.testing.junitplatform.JUnitPlatformTestClassProcessor.stop(JUnitPlatformTestClassProcessor.java:78)
at org.gradle.api.internal.tasks.testing.SuiteTestClassProcessor.stop(SuiteTestClassProcessor.java:61)
at org.gradle.internal.dispatch.ReflectionDispatch.dispatch(ReflectionDispatch.java:35)
at org.gradle.internal.dispatch.ReflectionDispatch.dispatch(ReflectionDispatch.java:24)
at org.gradle.internal.dispatch.ContextClassLoaderDispatch.dispatch(ContextClassLoaderDispatch.java:32)
at org.gradle.internal.dispatch.ProxyDispatchAdapter$DispatchingInvocationHandler.invoke(ProxyDispatchAdapter.java:93)
at org.gradle.api.internal.tasks.testing.worker.TestWorker.stop(TestWorker.java:132)
at org.gradle.internal.dispatch.ReflectionDispatch.dispatch(ReflectionDispatch.java:35)
at org.gradle.internal.dispatch.ReflectionDispatch.dispatch(ReflectionDispatch.java:24)
at org.gradle.internal.remote.internal.hub.MessageHubBackedObjectConnection$DispatchWrapper.dispatch(MessageHubBackedObjectConnection.java:175)
at org.gradle.internal.remote.internal.hub.MessageHubBackedObjectConnection$DispatchWrapper.dispatch(MessageHubBackedObjectConnection.java:157)
at org.gradle.internal.remote.internal.hub.MessageHub$Handler.run(MessageHub.java:404)
at org.gradle.internal.concurrent.ExecutorPolicy$CatchAndRecordFailures.onExecute(ExecutorPolicy.java:63)
at org.gradle.internal.concurrent.ManagedExecutorImpl$1.run(ManagedExecutorImpl.java:46)
at java.util.concurrent.ThreadPoolExecutor.runWorker(ThreadPoolExecutor.java:1149)
at java.util.concurrent.ThreadPoolExecutor$Worker.run(ThreadPoolExecutor.java:624)
at org.gradle.internal.concurrent.ThreadFactoryImpl$ManagedThreadRunnable.run(ThreadFactoryImpl.java:55)
at java.lang.Thread.run(Thread.java:748)

Task :test FAILED
6 actionable tasks: 5 executed, 1 up-to-date
finished running tests, now stopping gradle daemon
Stopping Daemon(s)
2 Daemons stopped

@vishalbihani2 Did you look at the expected output?

We are expecting an arrray of questions… looks like you are not sticking to the structure we are expecting…

Can you compare your output with what is expected?

I am on it. It was not specified before so i went with Lists.

Closing this topic as your issue is resolved by the mentor. If it is still not resolved, Kindly un-mark the accepted solution or create a new topic and post this question as a reference link in the description of the new topic.